Target
Metabotropic glutamate receptor 1
Ligand
BDBM50224393
Substrate
Meas. Tech.
ChEMBL_450774 (CHEMBL899859)
IC50
6±n/a nM
Citation
 Wu, WLBurnett, DADomalski, MGreenlee, WJLi, CBertorelli, RFredduzzi, SLozza, GVeltri, AReggiani, A Discovery of orally efficacious tetracyclic metabotropic glutamate receptor 1 (mGluR1) antagonists for the treatment of chronic pain. J Med Chem 50:5550-3 (2007)  
Target
Name:
Metabotropic glutamate receptor 1
Synonyms:
GPRC1A GRM1_HUMAN Metabotropic Glutamate 1a | metabotropic glutamate 1
Type:
Enzyme
Mol. Mass.:
132358.19
Organism:
Homo sapiens (Human)
Description:
Q13255
Residue:
1194
  
Inhibitor
Name:
BDBM50224393
Synonyms:
8-(4-chlorophenyl)-1h-imidazo[4'',5'':4',5']pyrido[3',2':4,5]thieno[3,2-d]pyrimidin-7(8H)-one | CHEMBL394914
Type:
Small organic molecule
Emp. Form.:
C16H8ClN5OS
Mol. Mass.:
353.786
SMILES:
Clc1ccc(cc1)-n1cnc2c(sc3ncc4[nH]cnc4c23)c1=O
: