Target
Metabotropic glutamate receptor 1
Ligand
BDBM50224389
Substrate
Meas. Tech.
ChEMBL_450774 (CHEMBL899859)
IC50
636±n/a nM
Citation
 Wu, WLBurnett, DADomalski, MGreenlee, WJLi, CBertorelli, RFredduzzi, SLozza, GVeltri, AReggiani, A Discovery of orally efficacious tetracyclic metabotropic glutamate receptor 1 (mGluR1) antagonists for the treatment of chronic pain. J Med Chem 50:5550-3 (2007)  
Target
Name:
Metabotropic glutamate receptor 1
Synonyms:
GPRC1A GRM1_HUMAN Metabotropic Glutamate 1a | metabotropic glutamate 1
Type:
Enzyme
Mol. Mass.:
132358.19
Organism:
Homo sapiens (Human)
Description:
Q13255
Residue:
1194
  
Inhibitor
Name:
BDBM50224389
Synonyms:
8-(4-methylphenyl)-2-(methylthio)thiazolo[4'',5'':4',5']pyrido[3',2':4,5]thieno[3,2-d]pyrimidin-7(8H)-one | CHEMBL235767
Type:
Small organic molecule
Emp. Form.:
C18H12N4OS3
Mol. Mass.:
396.509
SMILES:
CSc1nc2c(cnc3sc4c(ncn(-c5ccc(C)cc5)c4=O)c23)s1
: