Target
Metabotropic glutamate receptor 1
Ligand
BDBM50224402
Substrate
Meas. Tech.
ChEMBL_450777 (CHEMBL899862)
Ki
2.4±n/a nM
Citation
 Wu, WLBurnett, DADomalski, MGreenlee, WJLi, CBertorelli, RFredduzzi, SLozza, GVeltri, AReggiani, A Discovery of orally efficacious tetracyclic metabotropic glutamate receptor 1 (mGluR1) antagonists for the treatment of chronic pain. J Med Chem 50:5550-3 (2007)  
Target
Name:
Metabotropic glutamate receptor 1
Synonyms:
GRM1_RAT Grm1 Metabotropic glutamate receptor Mglur1 metabotropic glutamate 1/5-D metabotropic glutamate receptor 1 isoform alpha precursor
Type:
Enzyme Catalytic Domain
Mol. Mass.:
133240.47
Organism:
RAT
Description:
metabotropic glutamate 1/2 0 RAT::P23385
Residue:
1199
  
Inhibitor
Name:
BDBM50224402
Synonyms:
8-(4-chlorophenyl)-1h-pyrrolo[2'',3'':4',5']pyrido[3',2':4,5]thieno[3,2-d]pyrimidin-7(8H)-one | CHEMBL238077
Type:
Small organic molecule
Emp. Form.:
C17H9ClN4OS
Mol. Mass.:
352.798
SMILES:
Clc1ccc(cc1)-n1cnc2c(sc3ncc4cc[nH]c4c23)c1=O
: