Target
C-C chemokine receptor type 2
Ligand
BDBM50224502
Substrate
Meas. Tech.
ChEMBL_450803 (CHEMBL899888)
IC50
4±n/a nM
Citation
 Xia, MHou, CDeMong, DEPollack, SRPan, MBrackley, JAJain, NGerchak, CSinger, MMalaviya, RMatheis, MOlini, GCavender, DWachter, M Synthesis, structure-activity relationship and in vivo antiinflammatory efficacy of substituted dipiperidines as CCR2 antagonists. J Med Chem 50:5561-3 (2007)  
Target
Name:
C-C chemokine receptor type 2
Synonyms:
C-C chemokine receptor type 2 (CCR2) CCR2_HUMAN Chemoattractant Cytokine Receptor 2 (CCR2) Monocyte chemotactic protein-1 (MCP-1)
Type:
Enzyme
Mol. Mass.:
41932.32
Organism:
Homo sapiens (Human)
Description:
P41597
Residue:
374
  
Inhibitor
Name:
BDBM50224502
Synonyms:
(E)-2-(4-(2-methyl-1H-indol-3-yl)piperidin-1-yl)-2-(1-(3-(3,4,5-trifluorophenyl)acryloyl)piperidin-4-yl)acetic acid | CHEMBL392120
Type:
Small organic molecule
Emp. Form.:
C30H32F3N3O3
Mol. Mass.:
539.5886
SMILES:
Cc1[nH]c2ccccc2c1C1CCN(CC1)C(C1CCN(CC1)C(=O)\C=C\c1cc(F)c(F)c(F)c1)C(O)=O
: