Target
C-C chemokine receptor type 2
Ligand
BDBM50224507
Substrate
Meas. Tech.
ChEMBL_450803 (CHEMBL899888)
IC50
210±n/a nM
Citation
 Xia, MHou, CDeMong, DEPollack, SRPan, MBrackley, JAJain, NGerchak, CSinger, MMalaviya, RMatheis, MOlini, GCavender, DWachter, M Synthesis, structure-activity relationship and in vivo antiinflammatory efficacy of substituted dipiperidines as CCR2 antagonists. J Med Chem 50:5561-3 (2007)  
Target
Name:
C-C chemokine receptor type 2
Synonyms:
C-C chemokine receptor type 2 (CCR2) CCR2_HUMAN Chemoattractant Cytokine Receptor 2 (CCR2) Monocyte chemotactic protein-1 (MCP-1)
Type:
Enzyme
Mol. Mass.:
41932.32
Organism:
Homo sapiens (Human)
Description:
P41597
Residue:
374
  
Inhibitor
Name:
BDBM50224507
Synonyms:
(E)-2-(4-(1H-indol-3-yl)piperidin-1-yl)-2-(1-(3-(4-nitrophenyl)acryloyl)piperidin-4-yl)acetic acid | CHEMBL391460
Type:
Small organic molecule
Emp. Form.:
C29H32N4O5
Mol. Mass.:
516.5882
SMILES:
OC(=O)C(C1CCN(CC1)C(=O)\C=C\c1ccc(cc1)[N+]([O-])=O)N1CCC(CC1)c1c[nH]c2ccccc12
: