Target
Collagenase 3
Ligand
BDBM50224854
Substrate
Meas. Tech.
ChEMBL_458357 (CHEMBL941691)
IC50
0.6±n/a nM
Citation
 Freeman-Cook, KDReiter, LANoe, MCAntipas, ASDanley, DEDatta, KDowns, JTEisenbeis, SEskra, JDGarmene, DJGreer, EMGriffiths, RJGuzman, RHardink, JRJanat, FJones, CSMartinelli, GJMitchell, PGLaird, ERLiras, JLLopresti-Morrow, LLPandit, JReilly, UDRobertson, DVaughn-Bowser, MLWolf-Gouviea, LAYocum, SA Potent, selective spiropyrrolidine pyrimidinetrione inhibitors of MMP-13. Bioorg Med Chem Lett 17:6529-34 (2007)  
Target
Name:
Collagenase 3
Synonyms:
MMP-13 MMP13_HUMAN Matrix metalloproteinase-13 (MMP-13) | Matrix metalloproteinase-13 (MMP13)
Type:
Enzyme
Mol. Mass.:
53808.06
Organism:
Homo sapiens (Human)
Description:
P45452
Residue:
471
  
Inhibitor
Name:
BDBM50224854
Synonyms:
5-(2-ethoxyethyl)-5-[4-(4-fluorophenoxy)phenoxy]barbituric acid | CHEMBL222002
Type:
Small organic molecule
Emp. Form.:
C20H19FN2O6
Mol. Mass.:
402.3731
SMILES:
CCOCCC1(Oc2ccc(Oc3ccc(F)cc3)cc2)C(=O)NC(=O)NC1=O
: