Target
Seed linoleate 13S-lipoxygenase-1
Ligand
BDBM50225144
Substrate
Meas. Tech.
ChEMBL_451057 (CHEMBL900138)
IC50
70000±n/a nM
Citation
 Burguete, APontiki, EHadjipavlou-Litina, DVillar, RVicente, ESolano, BAncizu, SPérez-Silanes, SAldana, IMonge, A Synthesis and anti-inflammatory/antioxidant activities of some new ring substituted 3-phenyl-1-(1,4-di-N-oxide quinoxalin-2-yl)-2-propen-1-one derivatives and of their 4,5-dihydro-(1H)-pyrazole analogues. Bioorg Med Chem Lett 17:6439-43 (2007)  
Target
Name:
Seed linoleate 13S-lipoxygenase-1
Synonyms:
15-LOX 15-lipo-oxygenase (SLO) L-1 LOX1.1 Lipoxygenase (LOX) Lipoxygenase-1 | Seed lipoxygenase-1
Type:
Enzyme
Mol. Mass.:
94365.66
Organism:
Glycine max (soybean)
Description:
Residue:
839
  
Inhibitor
Name:
BDBM50225144
Synonyms:
6-fluoro-2-methyl-3-[5-(3,4,5-trimethoxy-phenyl)-4,5-dihydro-1H-pyrazol-3-yl]-quinoxaline 1,4-dioxide | CHEMBL393607
Type:
Small organic molecule
Emp. Form.:
C21H21FN4O5
Mol. Mass.:
428.4136
SMILES:
COc1cc(cc(OC)c1OC)C1C[C-](N=[NH+]1)c1c(C)[n+]([O-])c2ccc(F)cc2[n+]1[O-]
: