Target
Seed linoleate 13S-lipoxygenase-1
Ligand
BDBM50225146
Substrate
Meas. Tech.
ChEMBL_451057 (CHEMBL900138)
IC50
85000±n/a nM
Citation
 Burguete, APontiki, EHadjipavlou-Litina, DVillar, RVicente, ESolano, BAncizu, SPérez-Silanes, SAldana, IMonge, A Synthesis and anti-inflammatory/antioxidant activities of some new ring substituted 3-phenyl-1-(1,4-di-N-oxide quinoxalin-2-yl)-2-propen-1-one derivatives and of their 4,5-dihydro-(1H)-pyrazole analogues. Bioorg Med Chem Lett 17:6439-43 (2007)  
Target
Name:
Seed linoleate 13S-lipoxygenase-1
Synonyms:
15-LOX 15-lipo-oxygenase (SLO) L-1 LOX1.1 Lipoxygenase (LOX) Lipoxygenase-1 | Seed lipoxygenase-1
Type:
Enzyme
Mol. Mass.:
94365.66
Organism:
Glycine max (soybean)
Description:
Residue:
839
  
Inhibitor
Name:
BDBM50225146
Synonyms:
(E)-1-(7-fluoro-3-methyl-1,4-dioxy-quinoxalin-2-yl)-3-(4-hydroxy-3-methoxy-phenyl)-propenone | CHEMBL238171
Type:
Small organic molecule
Emp. Form.:
C19H15FN2O5
Mol. Mass.:
370.3312
SMILES:
COc1cc(\C=C\C(=O)c2c(C)[n+]([O-])c3ccc(F)cc3[n+]2[O-])ccc1O
: