Target
Vasopressin V1a receptor
Ligand
BDBM50225553
Substrate
Meas. Tech.
ChEMBL_451555 (CHEMBL901765)
IC50
7000±n/a nM
Citation
 Furber, MAlcaraz, LBent, JEBeyerbach, ABowers, KBraddock, MCaffrey, MVCladingboel, DCollington, JDonald, DKFagura, MInce, FKinchin, ECLaurent, CLawson, MLuker, TJMortimore, MMPimm, ADRiley, RJRoberts, NRobertson, MTheaker, JThorne, PVWeaver, RWebborn, PWillis, P Discovery of potent and selective adamantane-based small-molecule P2X(7) receptor antagonists/interleukin-1beta inhibitors. J Med Chem 50:5882-5 (2007)  
Target
Name:
Vasopressin V1a receptor
Synonyms:
AVPR V1a AVPR1A V1AR_HUMAN VASOPRESSIN V1A Vasopressin V1 receptor Vasopressin receptor
Type:
Receptor
Mol. Mass.:
46820.18
Organism:
Homo sapiens (Human)
Description:
P37288
Residue:
418
  
Inhibitor
Name:
BDBM50225553
Synonyms:
CHEMBL393754 | N-adamantan-1-ylmethyl-2-chloro-5-(9-oxa-3,7-diaza-bicyclo[3.3.1]nonane-3-carbonyl)-benzamide
Type:
Small organic molecule
Emp. Form.:
C25H32ClN3O3
Mol. Mass.:
457.993
SMILES:
Clc1ccc(cc1C(=O)NCC12CC3CC(CC(C3)C1)C2)C(=O)N1CC2CNCC(C1)O2
: