Target
C-X-C chemokine receptor type 1
Ligand
BDBM50227001
Substrate
Meas. Tech.
ChEMBL_461467 (CHEMBL927477)
Ki
38±n/a nM
Citation
 Biju, PTaveras, AYu, YZheng, JChao, JRindgen, DJakway, JHipkin, RWFossetta, JFan, XFine, JQiu, HMerritt, JRBaldwin, JJ 3,4-Diamino-2,5-thiadiazole-1-oxides as potent CXCR2/CXCR1 antagonists. Bioorg Med Chem Lett 18:228-31 (2008)  
Target
Name:
C-X-C chemokine receptor type 1
Synonyms:
C-X-C chemokine receptor type 1 (CXCR-1) CMKAR1 CXCR1_HUMAN Interleukin-8 receptor A | Interleukin-8 receptors, CXCR1/CXCR2
Type:
Enzyme
Mol. Mass.:
39803.83
Organism:
Homo sapiens (Human)
Description:
P25024
Residue:
350
  
Inhibitor
Name:
BDBM50227001
Synonyms:
3-{4-[(R)-2,2-dimethyl-1-(5-methyl-furan-2-yl)-propylamino]-1-oxo-1H-1lambda4-[1,2,5]thiadiazol-3-ylamino}-2-hydroxy-N,N-dimethyl-benzamide | CHEMBL403206
Type:
Small organic molecule
Emp. Form.:
C21H27N5O4S
Mol. Mass.:
445.535
SMILES:
CN(C)C(=O)c1cccc(Nc2ns(=O)nc2N[C@@H](c2ccc(C)o2)C(C)(C)C)c1O
: