Target
Peroxisome proliferator-activated receptor gamma
Ligand
BDBM50228360
Substrate
Meas. Tech.
ChEMBL_460035 (CHEMBL943154)
IC50
100±n/a nM
Citation
 Potterat, OPuder, CWagner, KBolek, WVettermann, RKauschke, SG Chlorocyclinones A-D, chlorinated angucyclinones from Streptomyces sp. strongly antagonizing rosiglitazone-induced PPAR-gamma activation. J Nat Prod 70:1934-8 (2007)  
Target
Name:
Peroxisome proliferator-activated receptor gamma
Synonyms:
NR1C3 PPAR-gamma PPARG_HUMAN Peroxisome proliferator-activated receptor gamma (PPAR gamma) Peroxisome proliferator-activated receptor gamma (PPARĪ³) peroxisome proliferator-activated receptor gamma isoform 2
Type:
Nuclear Receptor
Mol. Mass.:
57613.46
Organism:
Homo sapiens (Human)
Description:
P37231
Residue:
505
  
Inhibitor
Name:
BDBM50228360
Synonyms:
CHEMBL254814 | methyl 9-[1-(acetyloxyethyl)]-2-chloro-6,8-dihydroxy-1-methoxy-3-methyl-7,12-dioxo-7,12-dihydrotetraphene-10-carboxylate
Type:
Small organic molecule
Emp. Form.:
C26H21ClO9
Mol. Mass.:
512.893
SMILES:
COC(=O)c1cc2C(=O)c3c(C(=O)c2c(O)c1C(C)OC(C)=O)c(O)cc1cc(C)c(Cl)c(OC)c31
: