Target
Peroxisome proliferator-activated receptor gamma
Ligand
BDBM50228361
Substrate
Meas. Tech.
ChEMBL_460035 (CHEMBL943154)
IC50
320±n/a nM
Citation
 Potterat, OPuder, CWagner, KBolek, WVettermann, RKauschke, SG Chlorocyclinones A-D, chlorinated angucyclinones from Streptomyces sp. strongly antagonizing rosiglitazone-induced PPAR-gamma activation. J Nat Prod 70:1934-8 (2007)  
Target
Name:
Peroxisome proliferator-activated receptor gamma
Synonyms:
NR1C3 PPAR-gamma PPARG_HUMAN Peroxisome proliferator-activated receptor gamma (PPAR gamma) Peroxisome proliferator-activated receptor gamma (PPARĪ³) peroxisome proliferator-activated receptor gamma isoform 2
Type:
Nuclear Receptor
Mol. Mass.:
57613.46
Organism:
Homo sapiens (Human)
Description:
P37231
Residue:
505
  
Inhibitor
Name:
BDBM50228361
Synonyms:
2-chloro-6,8-dihydroxy-1-methoxy-3,9-dimethyltetrapheno[10,9-c]furan-7,11,13(9H)-trione | CHEMBL400132
Type:
Small organic molecule
Emp. Form.:
C23H15ClO7
Mol. Mass.:
438.814
SMILES:
COc1c(Cl)c(C)cc2cc(O)c3C(=O)c4c(O)c5C(C)OC(=O)c5cc4C(=O)c3c12
: