Target
Sodium-dependent serotonin transporter
Ligand
BDBM50228445
Substrate
Meas. Tech.
ChEMBL_452611 (CHEMBL902862)
Ki
1.3±n/a nM
Citation
 Parhi, AKWang, JLOya, SChoi, SRKung, MPKung, HF 2-(2'-((dimethylamino)methyl)-4'-(fluoroalkoxy)-phenylthio)benzenamine derivatives as serotonin transporter imaging agents. J Med Chem 50:6673-84 (2007)  
Target
Name:
Sodium-dependent serotonin transporter
Synonyms:
5-HT Transporter 5HTT SC6A4_HUMAN SLC6A4 Serotonin transporter (5HTT) Sodium-dependent serotonin transporter (SERT) | Solute carrier family 6 member 4
Type:
Multi-pass membrane protein
Mol. Mass.:
70322.51
Organism:
Homo sapiens (Human)
Description:
P31645
Residue:
630
  
Inhibitor
Name:
BDBM50228445
Synonyms:
3-(4-(2-aminophenylthio)-3-((dimethylamino)methyl)phenoxy)-1-propanol | CHEMBL241647
Type:
Small organic molecule
Emp. Form.:
C18H24N2O2S
Mol. Mass.:
332.46
SMILES:
CN(C)Cc1cc(OCCCO)ccc1Sc1ccccc1N
: