Target
Substance-P receptor
Ligand
BDBM50229591
Substrate
Meas. Tech.
ChEMBL_452917 (CHEMBL903160)
IC50
21±n/a nM
Citation
 Beard, DJPerrine, SAPhillips, EHoque, SConerly, STichenor, CSimmons, MAYoung, JK Conformational comparisons of a series of tachykinin peptide analogs. J Med Chem 50:6501-6 (2007)  
Target
Name:
Substance-P receptor
Synonyms:
NK-1 receptor NK1 Receptor Neurokinin 1 receptor SPR Tac1r Tacr1
Type:
G Protein-Coupled Receptor (GPCR)
Mol. Mass.:
46371.54
Organism:
Rattus norvegicus (rat)
Description:
Competition binding assays were carried out using membrane preparations from transfected CHO cells that constitutively expressed the rat NK1 receptor.
Residue:
407
  
Inhibitor
Name:
BDBM50229591
Synonyms:
Arg-Pro-Lys-Pro-Ala-Ser-Phe-Phe-Gly-Leu-Met-NH2 | CHEMBL413827
Type:
Small organic molecule
Emp. Form.:
C59H92N16O12S
Mol. Mass.:
1249.527
SMILES:
[#6]-[#16]-[#6]-[#6]-[#6@H](-[#7]-[#6](=O)-[#6@H](-[#6]-[#6](-[#6])-[#6])-[#7]-[#6](=O)-[#6]-[#7]-[#6](=O)-[#6@H](-[#6]-c1ccccc1)-[#7]-[#6](=O)-[#6@H](-[#6]-c1ccccc1)-[#7]-[#6](=O)-[#6@H](-[#6]-[#8])-[#7]-[#6](=O)-[#6@H](-[#6])-[#7]-[#6](=O)-[#6@@H]-1-[#6]-[#6]-[#6]-[#7]-1-[#6](=O)-[#6@H](-[#6]-[#6]-[#6]-[#6]-[#7])-[#7]-[#6](=O)-[#6@@H]-1-[#6]-[#6]-[#6]-[#7]-1-[#6](=O)-[#6@@H](-[#7])-[#6]-[#6]-[#6]\[#7]=[#6](\[#7])-[#7])-[#6](-[#7])=O
: