Target
Translocator protein
Ligand
BDBM50229594
Substrate
Meas. Tech.
ChEMBL_460138 (CHEMBL924980)
Ki
0.68±n/a nM
Citation
 Briard, EZoghbi, SSImaizumi, MGourley, JPShetty, HUHong, JCropley, VFujita, MInnis, RBPike, VW Synthesis and evaluation in monkey of two sensitive 11C-labeled aryloxyanilide ligands for imaging brain peripheral benzodiazepine receptors in vivo. J Med Chem 51:17-30 (2008)  
Target
Name:
Translocator protein
Synonyms:
Benzodiazepine receptors; peripheral & central Mbr PBR Peripheral benzodiazepine receptor (PBR) TSPO_RAT | Tspo
Type:
Mitochondrion membrane protein
Mol. Mass.:
18945.84
Organism:
Rattus norvegicus (rat)
Description:
Competitive binding experiments were performed on rat kidney mitochondrial membranes.
Residue:
169
  
Inhibitor
Name:
BDBM50229594
Synonyms:
CHEMBL253597 | N-(2-methoxybenzyl)-N-(4-phenoxypyridin-3-yl)acetamide
Type:
Small organic molecule
Emp. Form.:
C21H20N2O3
Mol. Mass.:
348.3951
SMILES:
COc1ccccc1CN(C(C)=O)c1cnccc1Oc1ccccc1
: