Target
Coagulation factor X
Ligand
BDBM50231275
Substrate
Meas. Tech.
ChEMBL_460575 (CHEMBL926651)
Ki
4.1±n/a nM
Citation
 Lee, YKParks, DJLu, TThieu, TVMarkotan, TPan, WMcComsey, DFMilkiewicz, KLCrysler, CSNinan, NAbad, MCGiardino, ECMaryanoff, BEDamiano, BPPlayer, MR 7-fluoroindazoles as potent and selective inhibitors of factor Xa. J Med Chem 51:282-97 (2008)  
Target
Name:
Coagulation factor X
Synonyms:
Activated coagulation factor X (FXa) Coagulation factor X precursor F10 Factor X heavy chain Factor Xa Stuart-Prower factor
Type:
Enzyme
Mol. Mass.:
54726.60
Organism:
Homo sapiens (Human)
Description:
Residue:
488
  
Inhibitor
Name:
BDBM50231275
Synonyms:
1-(3-aminobenzo[d]isoxazol-5-yl)-7-fluoro-6-[2-fluoro-4-(methylpyridin-4-ylamino)phenyl]-1H-indazole-3-carboxamide | CHEMBL400504
Type:
Small organic molecule
Emp. Form.:
C27H19F2N7O2
Mol. Mass.:
511.4823
SMILES:
CN(c1ccncc1)c1ccc(c(F)c1)-c1ccc2c(nn(-c3ccc4onc(N)c4c3)c2c1F)C(N)=O
: