Target
Delta-type opioid receptor
Ligand
BDBM50232771
Substrate
Meas. Tech.
ChEMBL_462216 (CHEMBL945985)
EC50
>1000±n/a nM
Citation
 Fichna, Jdo-Rego, JCJanecki, TStaniszewska, RPoels, JBroeck, JVCostentin, JSchiller, PWJanecka, A Novel highly potent mu-opioid receptor antagonist based on endomorphin-2 structure. Bioorg Med Chem Lett 18:1350-3 (2008)  
Target
Name:
Delta-type opioid receptor
Synonyms:
D-OR-1 Delta opioid receptor OPIATE Delta OPRD1 OPRK1 | opioid receptor, delta 1
Type:
G Protein-Coupled Receptor (GPCR)
Mol. Mass.:
40382.98
Organism:
Homo sapiens (Human)
Description:
Competition binding assays were carried out using membrane preparations from transfected HN9.10 cells that constitutively expressed the delta opioid receptor.
Residue:
372
  
Inhibitor
Name:
BDBM50232771
Synonyms:
CHEMBL254926 | Tyr-Sar-Phe-D-2-Nal-NH2
Type:
Small organic molecule
Emp. Form.:
C34H37N5O5
Mol. Mass.:
595.6881
SMILES:
CN(CC(=O)N[C@@H](Cc1ccccc1)C(=O)N[C@H](Cc1ccc2ccccc2c1)C(N)=O)C(=O)[C@@H](N)Cc1ccc(O)cc1
: