Target
Mu-type opioid receptor
Ligand
BDBM50232769
Substrate
Meas. Tech.
ChEMBL_462211 (CHEMBL945980)
IC50
1.5±n/a nM
Citation
 Fichna, Jdo-Rego, JCJanecki, TStaniszewska, RPoels, JBroeck, JVCostentin, JSchiller, PWJanecka, A Novel highly potent mu-opioid receptor antagonist based on endomorphin-2 structure. Bioorg Med Chem Lett 18:1350-3 (2008)  
Target
Name:
Mu-type opioid receptor
Synonyms:
MOR-1 Mu-type opioid receptor (MOR) OPRM_RAT Opioid receptor B Ror-b
Type:
G Protein-Coupled Receptor (GPCR)
Mol. Mass.:
44503.11
Organism:
Rattus norvegicus (rat)
Description:
Competition binding assays were carried out using membrane preparations from transfected HN9.10 cells that constitutively expressed the mu opioid receptor.
Residue:
398
  
Inhibitor
Name:
BDBM50232769
Synonyms:
CHEMBL254919 | Dmt-Pro-Phe-D-2-Nal-NH2
Type:
Small organic molecule
Emp. Form.:
C38H43N5O5
Mol. Mass.:
649.7785
SMILES:
Cc1cc(O)cc(C)c1C[C@H](N)C(=O)N1CCC[C@H]1C(=O)N[C@@H](Cc1ccccc1)C(=O)N[C@H](Cc1ccc2ccccc2c1)C(N)=O
: