Target
Mu-type opioid receptor
Ligand
BDBM50232771
Substrate
Meas. Tech.
ChEMBL_462211 (CHEMBL945980)
IC50
1560±n/a nM
Citation
 Fichna, Jdo-Rego, JCJanecki, TStaniszewska, RPoels, JBroeck, JVCostentin, JSchiller, PWJanecka, A Novel highly potent mu-opioid receptor antagonist based on endomorphin-2 structure. Bioorg Med Chem Lett 18:1350-3 (2008)  
Target
Name:
Mu-type opioid receptor
Synonyms:
MOR-1 Mu-type opioid receptor (MOR) OPRM_RAT Opioid receptor B Ror-b
Type:
G Protein-Coupled Receptor (GPCR)
Mol. Mass.:
44503.11
Organism:
Rattus norvegicus (rat)
Description:
Competition binding assays were carried out using membrane preparations from transfected HN9.10 cells that constitutively expressed the mu opioid receptor.
Residue:
398
  
Inhibitor
Name:
BDBM50232771
Synonyms:
CHEMBL254926 | Tyr-Sar-Phe-D-2-Nal-NH2
Type:
Small organic molecule
Emp. Form.:
C34H37N5O5
Mol. Mass.:
595.6881
SMILES:
CN(CC(=O)N[C@@H](Cc1ccccc1)C(=O)N[C@H](Cc1ccc2ccccc2c1)C(N)=O)C(=O)[C@@H](N)Cc1ccc(O)cc1
: