Target
Mu-type opioid receptor
Ligand
BDBM50232770
Substrate
Meas. Tech.
ChEMBL_462211 (CHEMBL945980)
IC50
0.010000±n/a nM
Citation
 Fichna, Jdo-Rego, JCJanecki, TStaniszewska, RPoels, JBroeck, JVCostentin, JSchiller, PWJanecka, A Novel highly potent mu-opioid receptor antagonist based on endomorphin-2 structure. Bioorg Med Chem Lett 18:1350-3 (2008)  
Target
Name:
Mu-type opioid receptor
Synonyms:
MOR-1 Mu-type opioid receptor (MOR) OPRM_RAT Opioid receptor B Ror-b
Type:
G Protein-Coupled Receptor (GPCR)
Mol. Mass.:
44503.11
Organism:
Rattus norvegicus (rat)
Description:
Competition binding assays were carried out using membrane preparations from transfected HN9.10 cells that constitutively expressed the mu opioid receptor.
Residue:
398
  
Inhibitor
Name:
BDBM50232770
Synonyms:
(S)-2-Amino-N-{[(S)-1-((R)-1-carbamoyl-2-naphthalen-2-yl-ethylcarbamoyl)-2-phenyl-ethylcarbamoyl]-methyl}-3-(4-hydroxy-2,6-dimethyl-phenyl)-N-methyl-propionamide Dmt-Sar-Phe-D-2-Nal-NH
Type:
Small organic molecule
Emp. Form.:
C36H41N5O5
Mol. Mass.:
623.7412
SMILES:
CN(CC(=O)N[C@@H](Cc1ccccc1)C(=O)N[C@H](Cc1ccc2ccccc2c1)C(N)=O)C(=O)[C@@H](N)Cc1c(C)cc(O)cc1C
: