Target
C-X-C chemokine receptor type 1
Ligand
BDBM50233554
Substrate
Meas. Tech.
ChEMBL_462399 (CHEMBL927215)
IC50
148±n/a nM
Citation
 Yu, YDwyer, MPChao, JAki, CChao, JPurakkattle, BRindgen, DBond, RMayer-Ezel, RJakway, JQiu, HHipkin, RWFossetta, JGonsiorek, WBian, HFan, XTerminelli, CFine, JLundell, DMerritt, JRHe, ZLai, GWu, MTaveras, A Synthesis and structure-activity relationships of heteroaryl substituted-3,4-diamino-3-cyclobut-3-ene-1,2-dione CXCR2/CXCR1 receptor antagonists. Bioorg Med Chem Lett 18:1318-22 (2008)  
Target
Name:
C-X-C chemokine receptor type 1
Synonyms:
C-X-C chemokine receptor type 1 (CXCR-1) CMKAR1 CXCR1_HUMAN Interleukin-8 receptor A | Interleukin-8 receptors, CXCR1/CXCR2
Type:
Enzyme
Mol. Mass.:
39803.83
Organism:
Homo sapiens (Human)
Description:
P25024
Residue:
350
  
Inhibitor
Name:
BDBM50233554
Synonyms:
(R)-3-(3,4-dioxo-2-(1-(pyridin-2-yl)propylamino)cyclobut-1-enylamino)-2-hydroxy-N,N-dimethylbenzamide | CHEMBL269707
Type:
Small organic molecule
Emp. Form.:
C21H22N4O4
Mol. Mass.:
394.4238
SMILES:
CC[C@@H](Nc1c(Nc2cccc(C(=O)N(C)C)c2O)c(=O)c1=O)c1ccccn1
: