Target
C-X-C chemokine receptor type 2
Ligand
BDBM50233558
Substrate
Meas. Tech.
ChEMBL_462398 (CHEMBL927214)
IC50
6.3±n/a nM
Citation
 Yu, YDwyer, MPChao, JAki, CChao, JPurakkattle, BRindgen, DBond, RMayer-Ezel, RJakway, JQiu, HHipkin, RWFossetta, JGonsiorek, WBian, HFan, XTerminelli, CFine, JLundell, DMerritt, JRHe, ZLai, GWu, MTaveras, A Synthesis and structure-activity relationships of heteroaryl substituted-3,4-diamino-3-cyclobut-3-ene-1,2-dione CXCR2/CXCR1 receptor antagonists. Bioorg Med Chem Lett 18:1318-22 (2008)  
Target
Name:
C-X-C chemokine receptor type 2
Synonyms:
C-X-C chemokine receptor type 2 (CXCR-2) CD_antigen=CD182 CXCR-2 CXCR2_HUMAN GRO/MGSA receptor IL-8 receptor type 2 IL8RB | Interleukin-8 receptor B
Type:
Protein
Mol. Mass.:
40767.88
Organism:
Homo sapiens (Human)
Description:
P25025
Residue:
360
  
Inhibitor
Name:
BDBM50233558
Synonyms:
(R)-2-hydroxy-N,N-dimethyl-3-(2-(1-(5-methylisoxazol-3-yl)propylamino)-3,4-dioxocyclobut-1-enylamino)benzamide | CHEMBL253927
Type:
Small organic molecule
Emp. Form.:
C20H22N4O5
Mol. Mass.:
398.4125
SMILES:
CC[C@@H](Nc1c(Nc2cccc(C(=O)N(C)C)c2O)c(=O)c1=O)c1cc(C)on1
: