Target
C-X-C chemokine receptor type 1
Ligand
BDBM50233563
Substrate
Meas. Tech.
ChEMBL_462399 (CHEMBL927215)
IC50
67±n/a nM
Citation
 Yu, YDwyer, MPChao, JAki, CChao, JPurakkattle, BRindgen, DBond, RMayer-Ezel, RJakway, JQiu, HHipkin, RWFossetta, JGonsiorek, WBian, HFan, XTerminelli, CFine, JLundell, DMerritt, JRHe, ZLai, GWu, MTaveras, A Synthesis and structure-activity relationships of heteroaryl substituted-3,4-diamino-3-cyclobut-3-ene-1,2-dione CXCR2/CXCR1 receptor antagonists. Bioorg Med Chem Lett 18:1318-22 (2008)  
Target
Name:
C-X-C chemokine receptor type 1
Synonyms:
C-X-C chemokine receptor type 1 (CXCR-1) CMKAR1 CXCR1_HUMAN Interleukin-8 receptor A | Interleukin-8 receptors, CXCR1/CXCR2
Type:
Enzyme
Mol. Mass.:
39803.83
Organism:
Homo sapiens (Human)
Description:
P25024
Residue:
350
  
Inhibitor
Name:
BDBM50233563
Synonyms:
3-(2-(1-(furan-2-yl)propylamino)-3,4-dioxocyclobut-1-enylamino)-2-hydroxy-N,N-dimethylbenzamide | CHEMBL252851
Type:
Small organic molecule
Emp. Form.:
C20H21N3O5
Mol. Mass.:
383.3978
SMILES:
CCC(Nc1c(Nc2cccc(C(=O)N(C)C)c2O)c(=O)c1=O)c1ccco1
: