Target
C-X-C chemokine receptor type 2
Ligand
BDBM50233578
Substrate
Meas. Tech.
ChEMBL_462398 (CHEMBL927214)
IC50
9.8±n/a nM
Citation
 Yu, YDwyer, MPChao, JAki, CChao, JPurakkattle, BRindgen, DBond, RMayer-Ezel, RJakway, JQiu, HHipkin, RWFossetta, JGonsiorek, WBian, HFan, XTerminelli, CFine, JLundell, DMerritt, JRHe, ZLai, GWu, MTaveras, A Synthesis and structure-activity relationships of heteroaryl substituted-3,4-diamino-3-cyclobut-3-ene-1,2-dione CXCR2/CXCR1 receptor antagonists. Bioorg Med Chem Lett 18:1318-22 (2008)  
Target
Name:
C-X-C chemokine receptor type 2
Synonyms:
C-X-C chemokine receptor type 2 (CXCR-2) CD_antigen=CD182 CXCR-2 CXCR2_HUMAN GRO/MGSA receptor IL-8 receptor type 2 IL8RB | Interleukin-8 receptor B
Type:
Protein
Mol. Mass.:
40767.88
Organism:
Homo sapiens (Human)
Description:
P25025
Residue:
360
  
Inhibitor
Name:
BDBM50233578
Synonyms:
2-hydroxy-3-(2-(1-(isoxazol-5-yl)propylamino)-3,4-dioxocyclobut-1-enylamino)-N,N-dimethylbenzamide | CHEMBL252698
Type:
Small organic molecule
Emp. Form.:
C19H20N4O5
Mol. Mass.:
384.3859
SMILES:
CCC(Nc1c(Nc2cccc(C(=O)N(C)C)c2O)c(=O)c1=O)c1ccno1
: