Target
Cyclin-dependent kinase 2
Ligand
BDBM50237846
Substrate
Meas. Tech.
ChEMBL_463093 (CHEMBL929003)
IC50
10±n/a nM
Citation
 Lee, JChoi, HKim, KHJeong, SPark, JWBaek, CSLee, SH Synthesis and biological evaluation of 3,5-diaminoindazoles as cyclin-dependent kinase inhibitors. Bioorg Med Chem Lett 18:2292-5 (2008)  
Target
Name:
Cyclin-dependent kinase 2
Synonyms:
CDK2 CDK2_HUMAN Cell division protein kinase 2 Protein cereblon/Cyclin-dependent kinase 2 | p33 protein kinase
Type:
Enzyme Subunit
Mol. Mass.:
33938.17
Organism:
Homo sapiens (Human)
Description:
P24941
Residue:
298
  
Inhibitor
Name:
BDBM50237846
Synonyms:
CHEMBL415789 | N-[5-(1,1-dioxo-1lambda*6*-isothiazolidin-2-yl)-1H-indazol-3-yl]-2-(4-methylsulfanyl-phenyl)-acetamide
Type:
Small organic molecule
Emp. Form.:
C19H20N4O3S2
Mol. Mass.:
416.517
SMILES:
CSc1ccc(CC(=O)Nc2n[nH]c3ccc(cc23)N2CCCS2(=O)=O)cc1
: