Target
Cyclin-dependent kinase 2
Ligand
BDBM50237851
Substrate
Meas. Tech.
ChEMBL_463093 (CHEMBL929003)
IC50
14±n/a nM
Citation
 Lee, JChoi, HKim, KHJeong, SPark, JWBaek, CSLee, SH Synthesis and biological evaluation of 3,5-diaminoindazoles as cyclin-dependent kinase inhibitors. Bioorg Med Chem Lett 18:2292-5 (2008)  
Target
Name:
Cyclin-dependent kinase 2
Synonyms:
CDK2 CDK2_HUMAN Cell division protein kinase 2 Protein cereblon/Cyclin-dependent kinase 2 | p33 protein kinase
Type:
Enzyme Subunit
Mol. Mass.:
33938.17
Organism:
Homo sapiens (Human)
Description:
P24941
Residue:
298
  
Inhibitor
Name:
BDBM50237851
Synonyms:
2-biphenyl-4-yl-N-[5-(1,1-dioxo-1lambda*6*-isothiazolidin-2-yl)-1H-indazol-3-yl]-acetamide | CHEMBL402759
Type:
Small organic molecule
Emp. Form.:
C24H22N4O3S
Mol. Mass.:
446.521
SMILES:
O=C(Cc1ccc(cc1)-c1ccccc1)Nc1n[nH]c2ccc(cc12)N1CCCS1(=O)=O
: