Target
Cyclin-dependent kinase 2
Ligand
BDBM50237859
Substrate
Meas. Tech.
ChEMBL_463093 (CHEMBL929003)
IC50
500±n/a nM
Citation
 Lee, JChoi, HKim, KHJeong, SPark, JWBaek, CSLee, SH Synthesis and biological evaluation of 3,5-diaminoindazoles as cyclin-dependent kinase inhibitors. Bioorg Med Chem Lett 18:2292-5 (2008)  
Target
Name:
Cyclin-dependent kinase 2
Synonyms:
CDK2 CDK2_HUMAN Cell division protein kinase 2 Protein cereblon/Cyclin-dependent kinase 2 | p33 protein kinase
Type:
Enzyme Subunit
Mol. Mass.:
33938.17
Organism:
Homo sapiens (Human)
Description:
P24941
Residue:
298
  
Inhibitor
Name:
BDBM50237859
Synonyms:
CHEMBL257625 | N-(5-(ethylamino)-1H-indazol-3-yl)-2-phenylacetamide
Type:
Small organic molecule
Emp. Form.:
C17H18N4O
Mol. Mass.:
294.351
SMILES:
CCNc1ccc2[nH]nc(NC(=O)Cc3ccccc3)c2c1
: