Target
Cyclin-dependent kinase 1
Ligand
BDBM50237854
Substrate
Meas. Tech.
ChEMBL_463095 (CHEMBL929005)
IC50
28±n/a nM
Citation
 Lee, JChoi, HKim, KHJeong, SPark, JWBaek, CSLee, SH Synthesis and biological evaluation of 3,5-diaminoindazoles as cyclin-dependent kinase inhibitors. Bioorg Med Chem Lett 18:2292-5 (2008)  
Target
Name:
Cyclin-dependent kinase 1
Synonyms:
CDC2 CDK1 CDKN1 Cell division protein kinase 1 P34CDC2 | p34 protein kinase
Type:
Enzyme Subunit
Mol. Mass.:
34101.08
Organism:
Homo sapiens (Human)
Description:
P06493
Residue:
297
  
Inhibitor
Name:
BDBM50237854
Synonyms:
CHEMBL255718 | N-[5-(1,1-dioxo-1lambda*6*-isothiazolidin-2-yl)-1H-indazol-3-yl]-2-(4-hydroxy-phenyl)-acetamide
Type:
Small organic molecule
Emp. Form.:
C18H18N4O4S
Mol. Mass.:
386.425
SMILES:
Oc1ccc(CC(=O)Nc2n[nH]c3ccc(cc23)N2CCCS2(=O)=O)cc1
: