Target
Cyclin-dependent kinase 1
Ligand
BDBM50237846
Substrate
Meas. Tech.
ChEMBL_463095 (CHEMBL929005)
IC50
40±n/a nM
Citation
 Lee, JChoi, HKim, KHJeong, SPark, JWBaek, CSLee, SH Synthesis and biological evaluation of 3,5-diaminoindazoles as cyclin-dependent kinase inhibitors. Bioorg Med Chem Lett 18:2292-5 (2008)  
Target
Name:
Cyclin-dependent kinase 1
Synonyms:
CDC2 CDK1 CDKN1 Cell division protein kinase 1 P34CDC2 | p34 protein kinase
Type:
Enzyme Subunit
Mol. Mass.:
34101.08
Organism:
Homo sapiens (Human)
Description:
P06493
Residue:
297
  
Inhibitor
Name:
BDBM50237846
Synonyms:
CHEMBL415789 | N-[5-(1,1-dioxo-1lambda*6*-isothiazolidin-2-yl)-1H-indazol-3-yl]-2-(4-methylsulfanyl-phenyl)-acetamide
Type:
Small organic molecule
Emp. Form.:
C19H20N4O3S2
Mol. Mass.:
416.517
SMILES:
CSc1ccc(CC(=O)Nc2n[nH]c3ccc(cc23)N2CCCS2(=O)=O)cc1
: