Target
Cyclin-dependent kinase 4
Ligand
BDBM50237845
Substrate
Meas. Tech.
ChEMBL_463094 (CHEMBL929004)
IC50
750±n/a nM
Citation
 Lee, JChoi, HKim, KHJeong, SPark, JWBaek, CSLee, SH Synthesis and biological evaluation of 3,5-diaminoindazoles as cyclin-dependent kinase inhibitors. Bioorg Med Chem Lett 18:2292-5 (2008)  
Target
Name:
Cyclin-dependent kinase 4
Synonyms:
CDK4 Cell division protein kinase 4 PSK-J3
Type:
Enzyme Subunit
Mol. Mass.:
33731.96
Organism:
Homo sapiens (Human)
Description:
P11802
Residue:
303
  
Inhibitor
Name:
BDBM50237845
Synonyms:
CHEMBL258040 N-[5-(1,1-dioxo-1lambda*6*-isothiazolidin-2-yl)-1H-indazol-3-yl]-2-(4-piperidin-1-yl-phenyl)-acetamide
Type:
Small organic molecule
Emp. Form.:
C23H27N5O3S
Mol. Mass.:
453.557
SMILES:
O=C(Cc1ccc(cc1)N1CCCCC1)Nc1n[nH]c2ccc(cc12)N1CCCS1(=O)=O
: