Target
Cyclin-dependent kinase 4
Ligand
BDBM50237858
Substrate
Meas. Tech.
ChEMBL_463094 (CHEMBL929004)
IC50
890±n/a nM
Citation
 Lee, JChoi, HKim, KHJeong, SPark, JWBaek, CSLee, SH Synthesis and biological evaluation of 3,5-diaminoindazoles as cyclin-dependent kinase inhibitors. Bioorg Med Chem Lett 18:2292-5 (2008)  
Target
Name:
Cyclin-dependent kinase 4
Synonyms:
CDK4 Cell division protein kinase 4 PSK-J3
Type:
Enzyme Subunit
Mol. Mass.:
33731.96
Organism:
Homo sapiens (Human)
Description:
P11802
Residue:
303
  
Inhibitor
Name:
BDBM50237858
Synonyms:
2-(2-chloro-phenyl)-N-[5-(1,1-dioxo-1lambda*6*-isothiazolidin-2-yl)-1H-indazol-3-yl]-acetamide | CHEMBL255463
Type:
Small organic molecule
Emp. Form.:
C18H17ClN4O3S
Mol. Mass.:
404.871
SMILES:
Clc1ccccc1CC(=O)Nc1n[nH]c2ccc(cc12)N1CCCS1(=O)=O
: