Target
Lysosomal alpha-glucosidase
Ligand
BDBM50031481
Substrate
Meas. Tech.
ChEMBL_548784 (CHEMBL1024237)
IC50
290000±n/a nM
Citation
 Asano, NKato, AMiyauchi, MKizu, HKameda, YWatson, AANash, RJFleet, GW Nitrogen-containing furanose and pyranose analogues from Hyacinthus orientalis. J Nat Prod 61:625-8 (1998)  
Target
Name:
Lysosomal alpha-glucosidase
Synonyms:
Acidic alpha-glucosidase LYAG_RAT
Type:
PROTEIN
Mol. Mass.:
106191.24
Organism:
Rattus norvegicus
Description:
ChEMBL_1506157
Residue:
953
  
Inhibitor
Name:
BDBM50031481
Synonyms:
(2R,3R,4R,5R)-2,5-Bis-hydroxymethyl-pyrrolidine-3,4-diol 2R,5R-dihydroxymethyl-3R,4R-dihydroxypyrrolidine | CHEMBL312653
Type:
Small organic molecule
Emp. Form.:
C6H13NO4
Mol. Mass.:
163.1717
SMILES:
OC[C@H]1N[C@H](CO)[C@@H](O)[C@@H]1O
: