Target
Trypsin
Ligand
BDBM50269531
Substrate
Meas. Tech.
ChEMBL_550822 (CHEMBL995689)
IC50
>200000±n/a nM
Citation
 Wang, DGirard, TJKasten, TPLaChance, RMMiller-Wideman, MADurley, RC Inhibitory activity of unsaturated fatty acids and anacardic acids toward soluble tissue factor-factor VIIa complex. J Nat Prod 61:1352-5 (1999)  
Target
Name:
Trypsin
Synonyms:
TRYP_PIG
Type:
PROTEIN
Mol. Mass.:
24411.24
Organism:
Sus scrofa
Description:
ChEMBL_1450738
Residue:
231
  
Inhibitor
Name:
BDBM50269531
Synonyms:
(9Z)-hexadec-9-enoic acid (Z)-hexadec-9-enoic acid 9-cis-hexadecenoic acid Palmitoleic acid (PoA) palmitoleic acid zoomaric acid
Type:
Small organic molecule
Emp. Form.:
C16H30O2
Mol. Mass.:
254.4082
SMILES:
CCCCCC\C=C/CCCCCCCC(O)=O
: