Target
DNA polymerase beta
Ligand
BDBM50259786
Substrate
Meas. Tech.
ChEMBL_524728 (CHEMBL980283)
IC50
15000±n/a nM
Citation
 Ma, JStarck, SRHecht, SM DNA polymerase beta inhibitors from Tetracera boiviniana. J Nat Prod 62:1660-3 (2000)  
Target
Name:
DNA polymerase beta
Synonyms:
DNA Polymerase beta Polb
Type:
PROTEIN
Mol. Mass.:
38334.34
Organism:
Rattus norvegicus
Description:
ChEMBL_1361926
Residue:
335
  
Inhibitor
Name:
BDBM50259786
Synonyms:
3-cis-p-coumaroyl maslinic acid | CHEMBL463995
Type:
Small organic molecule
Emp. Form.:
C39H54O5
Mol. Mass.:
602.8431
SMILES:
CC1(C)CC[C@@]2(CC[C@]3(C)C(=CC[C@@H]4[C@@]5(C)C[C@@H](O)[C@H](OC(=O)\C=C/c6ccccc6)C(C)(C)[C@@H]5CC[C@@]34C)[C@@H]2C1)C(O)=O
: