Target
Prostaglandin G/H synthase 2
Ligand
BDBM50152850
Substrate
Meas. Tech.
ChEMBL_508956 (CHEMBL1005508)
IC50
>500000±n/a nM
Citation
 Ringbom, THuss, UStenholm, AFlock, SSkattebøl, LPerera, PBohlin, L Cox-2 inhibitory effects of naturally occurring and modified fatty acids. J Nat Prod 64:745-9 (2001)  
Target
Name:
Prostaglandin G/H synthase 2
Synonyms:
COX2 Cyclooxygenase-2 (COX-2) PTGS2 Prostaglandin G/H synthase (cyclooxygenase)
Type:
Protein
Mol. Mass.:
68976.98
Organism:
Ovis aries (Sheep)
Description:
Residue:
603
  
Inhibitor
Name:
BDBM50152850
Synonyms:
1-HEXYLDECANOIC ACID Hexadecanoic acid Palmitic acid (PA)
Type:
Small organic molecule
Emp. Form.:
C16H32O2
Mol. Mass.:
256.4241
SMILES:
CCCCCCCCCCCCCCCC(O)=O
: