Target
DNA topoisomerase
Ligand
BDBM50164888
Substrate
Meas. Tech.
ChEMBL_509260 (CHEMBL996004)
IC50
307000±n/a nM
Citation
 Suzuki, KYahara, SMaehata, KUyeda, M Isoaurostatin, a novel topoisomerase inhibitor produced by Thermomonospora alba. J Nat Prod 64:204-7 (2001)  
Target
Name:
DNA topoisomerase
Synonyms:
Type:
PROTEIN
Mol. Mass.:
111544.55
Organism:
Bos taurus
Description:
ChEMBL_509260
Residue:
1002
  
Inhibitor
Name:
BDBM50164888
Synonyms:
6-Hydroxy-3-[1-(4-hydroxy-phenyl)-meth-(E)-ylidene]-3H-benzofuran-2-one isoaurostatin
Type:
Small organic molecule
Emp. Form.:
C15H10O4
Mol. Mass.:
254.2375
SMILES:
Oc1ccc(\C=C2\C(=O)Oc3cc(O)ccc23)cc1
: