Target
Type II restriction enzyme EcoRI
Ligand
BDBM50250713
Substrate
Meas. Tech.
ChEMBL_504581 (CHEMBL993793)
IC50
>50000±n/a nM
Citation
 Singh, SBOndeyka, JGSchleif, WAFelock, PHazuda, DJ Chemistry and structure-activity relationship of HIV-1 integrase inhibitor integracide B and related natural products. J Nat Prod 66:1338-44 (2003)  
Target
Name:
Type II restriction enzyme EcoRI
Synonyms:
T2E1_ECOLX ecoRIR
Type:
PROTEIN
Mol. Mass.:
31063.04
Organism:
Escherichia coli
Description:
ChEMBL_504581
Residue:
277
  
Inhibitor
Name:
BDBM50250713
Synonyms:
CHEMBL464128 | Integracide B
Type:
Small organic molecule
Emp. Form.:
C32H50O5
Mol. Mass.:
514.7364
SMILES:
CC(C)C(=C)CC[C@@H](C)[C@H]1CC=C2C3=C([C@@H](O)[C@H](OC(C)=O)[C@]12C)[C@@]1(C)C[C@@H](O)[C@H](O)C(C)(C)[C@@H]1CC3
: