Target
Type II restriction enzyme EcoRI
Ligand
BDBM50250756
Substrate
Meas. Tech.
ChEMBL_504581 (CHEMBL993793)
IC50
>50000±n/a nM
Citation
 Singh, SBOndeyka, JGSchleif, WAFelock, PHazuda, DJ Chemistry and structure-activity relationship of HIV-1 integrase inhibitor integracide B and related natural products. J Nat Prod 66:1338-44 (2003)  
Target
Name:
Type II restriction enzyme EcoRI
Synonyms:
T2E1_ECOLX ecoRIR
Type:
PROTEIN
Mol. Mass.:
31063.04
Organism:
Escherichia coli
Description:
ChEMBL_504581
Residue:
277
  
Inhibitor
Name:
BDBM50250756
Synonyms:
(2R,3R,5R,10S,11R,12R,13R,17R)-12-acetoxy-3,11-dihydroxy-4,4,10,13-tetramethyl-17-((R)-6-methyl-5-methyleneheptan-2-yl)-2,3,4,5,6,7,10,11,12,13,16,17-dodecahydro-1H-cyclopenta[a]phenanthren-2-yl 2-aminoacetate 2,2,2-trifluoroacetate | CHEMBL501573
Type:
Small organic molecule
Emp. Form.:
C34H53NO6
Mol. Mass.:
571.7877
SMILES:
CC(C)C(=C)CC[C@@H](C)[C@H]1CC=C2C3=C([C@@H](O)[C@H](OC(C)=O)[C@]12C)[C@@]1(C)C[C@@H](OC(=O)CN)[C@H](O)C(C)(C)[C@@H]1CC3
: