Target
Growth hormone secretagogue receptor type 1
Ligand
BDBM50260278
Substrate
Meas. Tech.
ChEMBL_509095 (CHEMBL1007239)
IC50
159±n/a nM
Citation
 Holst, BMokrosinski, JLang, MBrandt, ENygaard, RFrimurer, TMBeck-Sickinger, AGSchwartz, TW Identification of an efficacy switch region in the ghrelin receptor responsible for interchange between agonism and inverse agonism. J Biol Chem 282:15799-811 (2007)  
Target
Name:
Growth hormone secretagogue receptor type 1
Synonyms:
GH-releasing peptide receptor GHS-R GHSR_HUMAN Ghrelin receptor | Ghrelin receptor 1a (GHS-R1a)
Type:
Receptor
Mol. Mass.:
41334.57
Organism:
Homo sapiens (Human)
Description:
Receptor binding studies use plasma membranes from LLC PK-1 cells transiently transfected with hGHSR1a.
Residue:
366
  
Inhibitor
Name:
BDBM50260278
Synonyms:
CHEMBL444131 | wFwGG-NH2
Type:
Small organic molecule
Emp. Form.:
C35H38N8O5
Mol. Mass.:
650.7268
SMILES:
N[C@H](Cc1c[nH]c2ccccc12)C(=O)N[C@@H](Cc1ccccc1)C(=O)N[C@H](Cc1c[nH]c2ccccc12)C(=O)NCC(=O)NCC(N)=O
: