Target
Growth hormone secretagogue receptor type 1
Ligand
BDBM50260277
Substrate
Meas. Tech.
ChEMBL_509095 (CHEMBL1007239)
IC50
>1000±n/a nM
Citation
 Holst, BMokrosinski, JLang, MBrandt, ENygaard, RFrimurer, TMBeck-Sickinger, AGSchwartz, TW Identification of an efficacy switch region in the ghrelin receptor responsible for interchange between agonism and inverse agonism. J Biol Chem 282:15799-811 (2007)  
Target
Name:
Growth hormone secretagogue receptor type 1
Synonyms:
GH-releasing peptide receptor GHS-R GHSR_HUMAN Ghrelin receptor | Ghrelin receptor 1a (GHS-R1a)
Type:
Receptor
Mol. Mass.:
41334.57
Organism:
Homo sapiens (Human)
Description:
Receptor binding studies use plasma membranes from LLC PK-1 cells transiently transfected with hGHSR1a.
Residue:
366
  
Inhibitor
Name:
BDBM50260277
Synonyms:
CHEMBL447444 | wFwAA-NH2
Type:
Small organic molecule
Emp. Form.:
C37H42N8O5
Mol. Mass.:
678.78
SMILES:
C[C@H](NC(=O)[C@H](C)NC(=O)[C@@H](Cc1c[nH]c2ccccc12)NC(=O)[C@H](Cc1ccccc1)NC(=O)[C@H](N)Cc1c[nH]c2ccccc12)C(N)=O
: