Target
Growth hormone secretagogue receptor type 1
Ligand
BDBM50260273
Substrate
Meas. Tech.
ChEMBL_509093 (CHEMBL1007237)
IC50
210±n/a nM
Citation
 Holst, BMokrosinski, JLang, MBrandt, ENygaard, RFrimurer, TMBeck-Sickinger, AGSchwartz, TW Identification of an efficacy switch region in the ghrelin receptor responsible for interchange between agonism and inverse agonism. J Biol Chem 282:15799-811 (2007)  
Target
Name:
Growth hormone secretagogue receptor type 1
Synonyms:
GH-releasing peptide receptor GHS-R GHSR_HUMAN Ghrelin receptor | Ghrelin receptor 1a (GHS-R1a)
Type:
Receptor
Mol. Mass.:
41334.57
Organism:
Homo sapiens (Human)
Description:
Receptor binding studies use plasma membranes from LLC PK-1 cells transiently transfected with hGHSR1a.
Residue:
366
  
Inhibitor
Name:
BDBM50260273
Synonyms:
CHEMBL507636 | DprwFwLL-NH2
Type:
Small organic molecule
Emp. Form.:
C58H78N14O10
Mol. Mass.:
1131.3277
SMILES:
CC(C)C[C@H](NC(=O)[C@H](CC(C)C)NC(=O)[C@@H](Cc1c[nH]c2ccccc12)NC(=O)[C@H](Cc1ccccc1)NC(=O)[C@@H](Cc1c[nH]c2ccccc12)NC(=O)[C@@H](CCCN=C(N)N)NC(=O)[C@H]1CCCN1C(=O)[C@@H](N)CC(O)=O)C(N)=O
: