Target
Presenilin-1
Ligand
BDBM50241259
Substrate
Meas. Tech.
ChEMBL_507813 (CHEMBL941376)
EC50
0.114±n/a nM
Citation
 Czirr, ELeuchtenberger, SDorner-Ciossek, CSchneider, AJucker, MKoo, EHPietrzik, CUBaumann, KWeggen, S Insensitivity to Abeta42-lowering nonsteroidal anti-inflammatory drugs and gamma-secretase inhibitors is common among aggressive presenilin-1 mutations. J Biol Chem 282:24504-13 (2007)  
Target
Name:
Presenilin-1
Synonyms:
3.4.23.- Gamma-Secretase Subunit Presenilin-1 PS1 PSEN1 PSNL1 Presenilin-1 CTF12 Protein S182
Type:
Mol. Mass.:
52657.13
Organism:
Homo sapiens (Human)
Description:
P49768
Residue:
467
  
Inhibitor
Name:
BDBM50241259
Synonyms:
(2S)-2-((S)-2-(3,5-difluorophenyl)-2-hydroxyacetamido)-N-((7S)-5-methyl-6-oxo-6,7-dihydro-5H-dibenzo[b,d]azepin-7-yl)propanamide CHEMBL392068 | LY-411575
Type:
Small organic molecule
Emp. Form.:
C26H23F2N3O4
Mol. Mass.:
479.4753
SMILES:
C[C@H](NC(=O)[C@@H](O)c1cc(F)cc(F)c1)C(=O)N[C@H]1c2ccccc2-c2ccccc2N(C)C1=O
: