Target
Multidrug resistance-associated protein 1
Ligand
BDBM50005628
Substrate
Meas. Tech.
ChEMBL_508117 (CHEMBL1004854)
Kd
113±n/a nM
Citation
 Perrotton, TTrompier, DChang, XBDi Pietro, ABaubichon-Cortay, H (R)- and (S)-verapamil differentially modulate the multidrug-resistant protein MRP1. J Biol Chem 282:31542-8 (2007)  
Target
Name:
Multidrug resistance-associated protein 1
Synonyms:
7.6.2.2 ABCC1 ATP-binding cassette, sub-family C, member 1 isoform 1 LTC4 transporter MRP MRP1_HUMAN
Type:
Mol. Mass.:
171597.72
Organism:
Homo sapiens (Human)
Description:
P33527
Residue:
1531
  
Inhibitor
Name:
BDBM50005628
Synonyms:
(S) Verapamil 2-(3,4-Dimethoxy-phenyl)-5-{[2-(3,4-dimethoxy-phenyl)-ethyl]-methyl-amino}-2-isopropyl-pentanenitrile CHEMBL36148 verapamil-S
Type:
Small organic molecule
Emp. Form.:
C27H38N2O4
Mol. Mass.:
454.6016
SMILES:
COc1ccc(CCN(C)CCC[C@](C#N)(C(C)C)c2ccc(OC)c(OC)c2)cc1OC
: