Target
Neutrophil collagenase
Ligand
BDBM50031795
Substrate
Meas. Tech.
ChEMBL_510907 (CHEMBL1007241)
IC50
0.046000±n/a nM
Citation
 Campestre, CTortorella, PAgamennone, MPreziuso, SBiasone, ANuti, ERossello, AGallina, C Peptidyl 3-substituted 1-hydroxyureas as isosteric analogues of succinylhydroxamate MMP inhibitors. Eur J Med Chem 43:1008-14 (2008)  
Target
Name:
Neutrophil collagenase
Synonyms:
CLG1 MMP8 Matrix metalloproteinase-8 PMNL collagenase | PMNL-CL
Type:
Enzyme
Mol. Mass.:
53413.48
Organism:
Homo sapiens (Human)
Description:
P22894
Residue:
467
  
Inhibitor
Name:
BDBM50031795
Synonyms:
(N-(2-HYDROXAMATEMETHYLENE-4-METHYL-PENTOYL)PHENYLALANYL)METHYL AMINE (R)-N4-hydroxy-2-isobutyl-N1-((S)-1-(methylamino)-1-oxo-3-phenylpropan-2-yl)succinamide METHYLAMINO-PHENYLALANYL-LEUCYL-HYDROXAMIC ACID
Type:
Small organic molecule
Emp. Form.:
C18H27N3O4
Mol. Mass.:
349.4247
SMILES:
CNC(=O)[C@H](Cc1ccccc1)NC(=O)[C@H](CC(C)C)CC(=O)NO
: