Target
Metabotropic glutamate receptor 1
Ligand
BDBM50177063
Substrate
Meas. Tech.
ChEMBL_511021 (CHEMBL999637)
IC50
4±n/a nM
Citation
 Nataraja Sekhar, YRavikumar, MRavi Shashi Nayana, MMallena, SCKishore Kumar, M 3D-QSAR studies of triazafluorenone inhibitors of metabotropic glutamate receptor subtype 1. Eur J Med Chem 43:1025-34 (2008)  
Target
Name:
Metabotropic glutamate receptor 1
Synonyms:
GRM1_RAT Grm1 Metabotropic glutamate receptor Mglur1 metabotropic glutamate 1/5-D metabotropic glutamate receptor 1 isoform alpha precursor
Type:
Enzyme Catalytic Domain
Mol. Mass.:
133240.47
Organism:
RAT
Description:
metabotropic glutamate 1/2 0 RAT::P23385
Residue:
1199
  
Inhibitor
Name:
BDBM50177063
Synonyms:
3-(4-Bromo-phenyl)-9-dimethylamino-3H-pyrido[3',2':4,5]thieno[3,2-d]pyrimidin-4-one CHEMBL225590
Type:
Small organic molecule
Emp. Form.:
C17H13BrN4OS
Mol. Mass.:
401.28
SMILES:
CN(C)c1ccnc2sc3c(ncn(-c4ccc(Br)cc4)c3=O)c12
: