Target
Cytochrome P450 3A4
Ligand
BDBM50265001
Substrate
Meas. Tech.
ChEMBL_497350 (CHEMBL999389)
IC50
77600±n/a nM
Citation
 Appiah-Opong, Rde Esch, ICommandeur, JNAndarini, MVermeulen, NP Structure-activity relationships for the inhibition of recombinant human cytochromes P450 by curcumin analogues. Eur J Med Chem 43:1621-31 (2008)  
Target
Name:
Cytochrome P450 3A4
Synonyms:
Albendazole monooxygenase CP3A4_HUMAN CYP3A4 CYPIIIA4 Cytochrome P450 3A4 (CYP3A4) Nifedipine oxidase Taurochenodeoxycholate 6-alpha-hydroxylase
Type:
Enzyme
Mol. Mass.:
57349.57
Organism:
Homo sapiens (Human)
Description:
Residue:
503
  
Inhibitor
Name:
BDBM50265001
Synonyms:
2,5-bis(4-hydroxy-3,5-diisopropylbenzylidene)cyclopentanone | CHEMBL498371
Type:
Small organic molecule
Emp. Form.:
C31H40O3
Mol. Mass.:
460.6475
SMILES:
CC(C)c1cc(\C=C2/CC\C(=C/c3cc(C(C)C)c(O)c(c3)C(C)C)C2=O)cc(C(C)C)c1O
: