Target
DNA topoisomerase 2-alpha
Ligand
BDBM50251125
Substrate
Meas. Tech.
ChEMBL_529838 (CHEMBL967541)
IC50
50000±n/a nM
Citation
 Hasinoff, BBLiang, HWu, XGuziec, LJGuziec, FSMarshall, KYalowich, JC The structure-based design, synthesis and biological evaluation of DNA-binding bisintercalating bisanthrapyrazole anticancer compounds. Bioorg Med Chem 16:3959-68 (2008)  
Target
Name:
DNA topoisomerase 2-alpha
Synonyms:
DNA topoisomerase 2-alpha DNA topoisomerase II (Topo II) DNA topoisomerase II, alpha isozyme TOP2A Topoisomerase I/II | Topoisomerase II alpha (HuTopoIIα)
Type:
Protein
Mol. Mass.:
174415.30
Organism:
Homo sapiens (Human)
Description:
P11388
Residue:
1531
  
Inhibitor
Name:
BDBM50251125
Synonyms:
Bis(2-((2-(7-chloro-6-oxo-6H-dibenzo[cd,g]indazol-2-yl)-ethyl)-methyl-amino)-ethyl) succinate | CHEMBL506257
Type:
Small organic molecule
Emp. Form.:
C42H38Cl2N6O6
Mol. Mass.:
793.694
SMILES:
CN(CCOC(=O)CCC(=O)OCCN(C)CCn1nc2-c3cccc(Cl)c3C(=O)c3cccc1c23)CCn1nc2-c3cccc(Cl)c3C(=O)c3cccc1c23
: