Target
D(3) dopamine receptor
Ligand
BDBM50251026
Substrate
Meas. Tech.
ChEMBL_529941 (CHEMBL975012)
IC50
15±n/a nM
Citation
 Sipos, AKiss, BSchmidt, EGreiner, IBerényi, S Synthesis and neuropharmacological evaluation of 2-aryl- and alkylapomorphines. Bioorg Med Chem 16:3773-9 (2008)  
Target
Name:
D(3) dopamine receptor
Synonyms:
DOPAMINE D3 Dopamine D3 receptor | Drd3
Type:
Protein
Mol. Mass.:
49540.58
Organism:
Rattus norvegicus (Rat)
Description:
P19020
Residue:
446
  
Inhibitor
Name:
BDBM50251026
Synonyms:
(R)-(-)-2-Phenyl-apomorphine hydrochloride CHEMBL465054
Type:
Small organic molecule
Emp. Form.:
C23H21NO2
Mol. Mass.:
343.4183
SMILES:
CN1CCc2cc(cc-3c2[C@H]1Cc1ccc(O)c(O)c-31)-c1ccccc1
: