Target
DNA polymerase subunit gamma-1
Ligand
BDBM50251277
Substrate
Meas. Tech.
ChEMBL_533421 (CHEMBL983382)
IC50
35000±n/a nM
Citation
 Kimura, TNishida, MKuramochi, KSugawara, FYoshida, HMizushina, Y Novel azaphilones, kasanosins A and B, which are specific inhibitors of eukaryotic DNA polymerases beta and lambda from Talaromyces sp. Bioorg Med Chem 16:4594-9 (2008)  
Target
Name:
DNA polymerase subunit gamma-1
Synonyms:
DNA Polymerase gamma DNA polymerase (alpha/delta/epsilon) DNA polymerase delta subunit 1 DNA polymerase gamma subunit 1 DNA polymerase kappa DNA polymerase subunit gamma-1 DPOG1_HUMAN Mitochondrial DNA polymerase catalytic subunit POLG1 PolG-alpha
Type:
Enzyme Subunit
Mol. Mass.:
139566.98
Organism:
Homo sapiens (Human)
Description:
Enzyme was purchased from Ulrich Hubscher, University of Zurich-Irchel, Switzerland.
Residue:
1239
  
Inhibitor
Name:
BDBM50251277
Synonyms:
CHEMBL458178 | Kasanosin A
Type:
Small organic molecule
Emp. Form.:
C22H24O8
Mol. Mass.:
416.4212
SMILES:
COc1cc(C)c(C(=O)O[C@H]2CC3=C(COC(\C=C\CO)=C3)C(=O)[C@@]2(C)O)c(O)c1
: