Target
Peroxisome proliferator-activated receptor delta
Ligand
BDBM50103938
Substrate
Meas. Tech.
ChEMBL_544073 (CHEMBL1019533)
EC50
10000±n/a nM
Citation
 Shah, PMittal, ABharatam, PV CoMFA analysis of dual/multiple PPAR activators. Eur J Med Chem 43:2784-91 (2008)  
Target
Name:
Peroxisome proliferator-activated receptor delta
Synonyms:
NR1C2 NUCI Nuclear receptor subfamily 1 group C member 2 PPAR-beta PPARD Peroxisome proliferator-activated receptor Peroxisome proliferator-activated receptor delta
Type:
Enzyme
Mol. Mass.:
49910.45
Organism:
Homo sapiens (Human)
Description:
Q03181
Residue:
441
  
Inhibitor
Name:
BDBM50103938
Synonyms:
2-Isopropoxy-3-[4-(5-phenyl-[1,2,4]oxadiazol-3-ylmethoxy)-phenyl]-propionic acid CHEMBL311429
Type:
Small organic molecule
Emp. Form.:
C21H22N2O5
Mol. Mass.:
382.4098
SMILES:
CC(C)OC(Cc1ccc(OCc2noc(n2)-c2ccccc2)cc1)C(O)=O
: